关于“Cloud Operations for GKE”的评价

关于“Cloud Operations for GKE”的评价

评论

Unable to apply the kubernetes yaml file. Deployment is not available on version v1beta1. I have to manually change it to apiVersion: apps/v1. It's not told in the tutorial.

Ferdinandus R. · 评论over 4 years之前

Shingo Y. · 评论over 4 years之前

amazing

Irsyaad B. · 评论over 4 years之前

amazing

Irsyaad B. · 评论over 4 years之前

Error found in 'make create' for 'prometheus-service-sed.yaml' manifest google_container_cluster.primary (local-exec): error: unable to recognize "../manifests/prometheus-service-sed.yaml": no matches for kind "Deployment" in version "extensions/v1beta1" Error: Error running command 'kubectl -n default apply -f ../manifests/prometheus-service-sed.yaml': exit status 1. Output: service/prometheus created configmap/prometheus created error: unable to recognize "../manifests/prometheus-service-sed.yaml": no matches for kind "Deployment" in version "extensions/v1beta1" Makefile:26: recipe for target 'create' failed make: *** [create] Error 1

Rasis Syauqi B. · 评论over 4 years之前

Lab was not working. Got the error as google_container_cluster.primary: Still creating... [3m10s elapsed] google_container_cluster.primary (local-exec): clusterrole.rbac.authorization.k8s.io/prometheus created google_container_cluster.primary (local-exec): serviceaccount/prometheus created google_container_cluster.primary (local-exec): clusterrolebinding.rbac.authorization.k8s.io/prometheus-stackdriver created google_container_cluster.primary: Provisioning with 'local-exec'... google_container_cluster.primary (local-exec): Executing: ["/bin/sh" "-c" "kubectl -n default apply -f ../manifests/prometheus-service-sed.yaml"] google_container_cluster.primary (local-exec): service/prometheus created google_container_cluster.primary (local-exec): configmap/prometheus created google_container_cluster.primary (local-exec): error: unable to recognize "../manifests/prometheus-service-sed.yaml": no matches for kind "Deployment" in version "extensions/v1beta1" Error: Error running command 'kubectl -n default apply -f ../manifests/prometheus-service-sed.yaml': exit status 1. Output: service/prometheus created

Niran V. · 评论over 4 years之前

Rasis Syauqi B. · 评论over 4 years之前

Naoto K. · 评论over 4 years之前

Doyoub L. · 评论over 4 years之前

Doyoub L. · 评论over 4 years之前

Doyoub L. · 评论over 4 years之前

make create takes too long

Erick W. · 评论over 4 years之前

still get error of make crate

Jufianto H. · 评论over 4 years之前

Jufianto H. · 评论over 4 years之前

Code from github need to be renewed, because of misconfiguration for YAML manifest configuration

Christopher L. · 评论over 4 years之前

pending

jeremy j. · 评论over 4 years之前

Elmo A. · 评论over 4 years之前

chrisna d. · 评论over 4 years之前

chrisna d. · 评论over 4 years之前

Bayu Adi W. · 评论over 4 years之前

aditya r. · 评论over 4 years之前

Bintang L. · 评论over 4 years之前

There is an error said kind Deployment not found

Dipta L. · 评论over 4 years之前

Bintang L. · 评论over 4 years之前

Bintang L. · 评论over 4 years之前

我们无法确保发布的评价来自已购买或已使用产品的消费者。评价未经 Google 核实。